IPW2200

Fórumok

IPW2200

Hozzászólások

Sewastok!

Rengeteget keresgéltem neten, de nem találtam semmilyen megoldást a problémámra. Követtem jónéhány leírást a fent említett hálókari telepítéséhez. Firmware a helyén, source apt-get-tel telepítve. Module-assisntant-tal próbáltam forgatni, de leáll, és nem tudtam kideríteni miért.
Itt a buildlog releváns része:
[code:1:f8182d69f7]make[4]: Entering directory `/usr/src/modules/ipw2200/driver'
gcc -D__KERNEL__ -I/usr/src/kernel-headers-2.4.27-2-386/include -Wall -Wstrict-prototypes -Wno-trigraphs -Os -fno-strict-aliasing -fno-common -fomit-frame-pointer -pipe -mpreferred-stack-boundary=2 -march=i386 -DMODULE -DMODVERSIONS -include /usr/src/kernel-headers-2.4.27-2-386/include/linux/modversions.h -g -Wa,-adhlms=.lst -I/usr/src/modules/ipw2200/driver -DCONFIG_IPW_DEBUG=y -DCONFIG_IEEE80211_DEBUG=y -DCONFIG_IEEE80211_CRYPT_WEP=m -DCONFIG_IEEE80211_CRYPT_TKIP=m -DCONFIG_IEEE80211_CRYPT_CCMP=m -nostdinc -iwithprefix include -DKBUILD_BASENAME=ipw2200 -DEXPORT_SYMTAB -c ipw2200.c
In file included from ipw2200.c:33:
ipw2200.h:54:29: linux/workqueue.h: Nincs ilyen fájl vagy könyvtár
In file included from ipw2200.c:33:
ipw2200.h:1117: error: field `adhoc_check' has incomplete type
ipw2200.h:1118: error: field `associate' has incomplete type
ipw2200.h:1119: error: field `disassociate' has incomplete type
ipw2200.h:1120: error: field `rx_replenish' has incomplete type
ipw2200.h:1121: error: field `request_scan' has incomplete type
ipw2200.h:1122: error: field `adapter_restart' has incomplete type
ipw2200.h:1123: error: field `rf_kill' has incomplete type
ipw2200.h:1124: error: field `up' has incomplete type
ipw2200.h:1125: error: field `down' has incomplete type
ipw2200.h:1126: error: field `gather_stats' has incomplete type
ipw2200.h:1127: error: field `abort_scan' has incomplete type
ipw2200.h:1128: error: field `roam' has incomplete type
ipw2200.h:1129: error: field `scan_check' has incomplete type
ipw2200.h:1130: error: field `link_up' has incomplete type
ipw2200.h:1131: error: field `link_down' has incomplete type
ipw2200.h:1144: error: field `led_link_on' has incomplete type
ipw2200.h:1145: error: field `led_link_off' has incomplete type
ipw2200.h:1146: error: field `led_act_off' has incomplete type
ipw2200.h:1148: error: field `merge_networks' has incomplete type
ipw2200.c:41: error: syntax error before string constant
ipw2200.c:41: warning: type defaults to `int' in declaration of `MODULE_VERSION'
ipw2200.c:41: warning: function declaration isn't a prototype
ipw2200.c:41: warning: data definition has no type or storage class
ipw2200.c: In function `ipw_led_link_on':
ipw2200.c:703: warning: implicit declaration of function `queue_delayed_work'
ipw2200.c: In function `ipw_led_activity_on':
ipw2200.c:799: warning: implicit declaration of function `cancel_delayed_work'
ipw2200.c: At top level:
ipw2200.c:1005: warning: `struct device_driver' declared inside parameter list
ipw2200.c:1005: warning: its scope is only this definition or declaration, which is probably not what you want
ipw2200.c:1010: warning: `struct device_driver' declared inside parameter list
ipw2200.c:1031: error: syntax error before numeric constant
ipw2200.c:1031: warning: type defaults to `int' in declaration of `DRIVER_ATTR'
ipw2200.c:1031: warning: function declaration isn't a prototype
ipw2200.c:1032: warning: type defaults to `int' in declaration of `show_debug_level'
ipw2200.c:1032: error: `show_debug_level' redeclared as different kind of symbol
ipw2200.c:1006: error: previous declaration of `show_debug_level'
ipw2200.c:1032: warning: type defaults to `int' in declaration of `store_debug_level'
ipw2200.c:1032: error: `store_debug_level' redeclared as different kind of symbol
ipw2200.c:1011: error: previous declaration of `store_debug_level'
ipw2200.c:1032: error: syntax error before ')' token
ipw2200.c:1037: warning: `struct device' declared inside parameter list
ipw2200.c: In function `show_stats':
ipw2200.c:1039: warning: implicit declaration of function `dev_get_drvdata'
ipw2200.c:1039: warning: initialization makes pointer from integer without a cast
ipw2200.c: At top level:
ipw2200.c:1044: error: syntax error before '(' token
ipw2200.c:1044: warning: type defaults to `int' in declaration of `DEVICE_ATTR'
ipw2200.c:1044: warning: function declaration isn't a prototype
ipw2200.c:1044: warning: type defaults to `int' in declaration of `show_stats'
ipw2200.c:1044: error: `show_stats' redeclared as different kind of symbol
ipw2200.c:1038: error: previous declaration of `show_stats'
ipw2200.c:1044: error: syntax error before "void"
ipw2200.c:1047: warning: `struct device' declared inside parameter list
ipw2200.c: In function `show_scan_age':
ipw2200.c:1049: warning: initialization makes pointer from integer without a cast
ipw2200.c: At top level:
ipw2200.c:1053: warning: `struct device' declared inside parameter list
ipw2200.c: In function `store_scan_age':
ipw2200.c:1055: warning: initialization makes pointer from integer without a cast
ipw2200.c: At top level:
ipw2200.c:1088: error: syntax error before numeric constant
ipw2200.c:1088: warning: type defaults to `int' in declaration of `DEVICE_ATTR'
ipw2200.c:1088: warning: function declaration isn't a prototype
ipw2200.c:1088: warning: type defaults to `int' in declaration of `show_scan_age'
ipw2200.c:1088: error: `show_scan_age' redeclared as different kind of symbol
ipw2200.c:1048: error: previous declaration of `show_scan_age'
ipw2200.c:1088: warning: type defaults to `int' in declaration of `store_scan_age'
ipw2200.c:1088: error: `store_scan_age' redeclared as different kind of symbol
ipw2200.c:1054: error: previous declaration of `store_scan_age'
ipw2200.c:1088: error: syntax error before ')' token
ipw2200.c:1090: warning: `struct device' declared inside parameter list
ipw2200.c: In function `show_led':
ipw2200.c:1092: warning: initialization makes pointer from integer without a cast
ipw2200.c: At top level:
ipw2200.c:1096: warning: `struct device' declared inside parameter list
ipw2200.c: In function `store_led':
ipw2200.c:1098: warning: initialization makes pointer from integer without a cast
ipw2200.c: At top level:
ipw2200.c:1118: error: syntax error before numeric constant
ipw2200.c:1118: warning: type defaults to `int' in declaration of `DEVICE_ATTR'
ipw2200.c:1118: warning: function declaration isn't a prototype
ipw2200.c:1118: warning: type defaults to `int' in declaration of `show_led'
ipw2200.c:1118: error: `show_led' redeclared as different kind of symbol
ipw2200.c:1091: error: previous declaration of `show_led'
ipw2200.c:1118: warning: type defaults to `int' in declaration of `store_led'
ipw2200.c:1118: error: `store_led' redeclared as different kind of symbol
ipw2200.c:1097: error: previous declaration of `store_led'
ipw2200.c:1118: error: syntax error before ')' token
ipw2200.c:1121: warning: `struct device' declared inside parameter list
ipw2200.c: In function `show_status':
ipw2200.c:1123: error: dereferencing pointer to incomplete type
ipw2200.c: At top level:
ipw2200.c:1126: error: syntax error before '(' token
ipw2200.c:1126: warning: type defaults to `int' in declaration of `DEVICE_ATTR'
ipw2200.c:1126: warning: function declaration isn't a prototype
ipw2200.c:1126: warning: type defaults to `int' in declaration of `show_status'
ipw2200.c:1126: error: `show_status' redeclared as different kind of symbol
ipw2200.c:1122: error: previous declaration of `show_status'
ipw2200.c:1126: error: syntax error before "void"
ipw2200.c:1128: warning: `struct device' declared inside parameter list
ipw2200.c: In function `show_cfg':
ipw2200.c:1130: error: dereferencing pointer to incomplete type
ipw2200.c: At top level:
ipw2200.c:1133: error: syntax error before '(' token
ipw2200.c:1133: warning: type defaults to `int' in declaration of `DEVICE_ATTR'
ipw2200.c:1133: warning: function declaration isn't a prototype
ipw2200.c:1133: warning: type defaults to `int' in declaration of `show_cfg'
ipw2200.c:1133: error: `show_cfg' redeclared as different kind of symbol
ipw2200.c:1129: error: previous declaration of `show_cfg'
ipw2200.c:1133: error: syntax error before "void"
ipw2200.c:1135: warning: `struct device' declared inside parameter list
ipw2200.c: In function `show_nic_type':
ipw2200.c:1137: error: dereferencing pointer to incomplete type
ipw2200.c: At top level:
ipw2200.c:1141: error: syntax error before '(' token
ipw2200.c:1141: warning: type defaults to `int' in declaration of `DEVICE_ATTR'
ipw2200.c:1141: warning: function declaration isn't a prototype
ipw2200.c:1141: warning: type defaults to `int' in declaration of `show_nic_type'
ipw2200.c:1141: error: `show_nic_type' redeclared as different kind of symbol
ipw2200.c:1136: error: previous declaration of `show_nic_type'
ipw2200.c:1141: error: syntax error before "void"
ipw2200.c:1144: warning: `struct device' declared inside parameter list
ipw2200.c: In function `dump_error_log':
ipw2200.c:1149: error: dereferencing pointer to incomplete type
ipw2200.c: At top level:
ipw2200.c:1153: error: syntax error before numeric constant
ipw2200.c:1156: warning: `struct device' declared inside parameter list
ipw2200.c: In function `dump_event_log':
ipw2200.c:1161: error: dereferencing pointer to incomplete type
ipw2200.c: At top level:
ipw2200.c:1165: error: syntax error before numeric constant
ipw2200.c:1167: warning: `struct device' declared inside parameter list
ipw2200.c: In function `show_ucode_version':
ipw2200.c:1170: error: dereferencing pointer to incomplete type
ipw2200.c: At top level:
ipw2200.c:1177: error: syntax error before numeric constant
ipw2200.c:1177: warning: type defaults to `int' in declaration of `DEVICE_ATTR'
ipw2200.c:1177: warning: function declaration isn't a prototype
ipw2200.c:1177: warning: type defaults to `int' in declaration of `show_ucode_version'
ipw2200.c:1177: error: `show_ucode_version' redeclared as different kind of symbol
ipw2200.c:1168: error: previous declaration of `show_ucode_version'
ipw2200.c:1177: error: syntax error before "void"
ipw2200.c:1179: warning: `struct device' declared inside parameter list
ipw2200.c: In function `show_rtc':
ipw2200.c:1182: error: dereferencing pointer to incomplete type
ipw2200.c: At top level:
ipw2200.c:1189: error: syntax error before numeric constant
ipw2200.c:1189: warning: type defaults to `int' in declaration of `DEVICE_ATTR'
ipw2200.c:1189: warning: function declaration isn't a prototype
ipw2200.c:1189: warning: type defaults to `int' in declaration of `show_rtc'
ipw2200.c:1189: error: `show_rtc' redeclared as different kind of symbol
ipw2200.c:1180: error: previous declaration of `show_rtc'
ipw2200.c:1189: error: syntax error before "void"
ipw2200.c:1195: warning: `struct device' declared inside parameter list
ipw2200.c: In function `show_eeprom_delay':
ipw2200.c:1197: error: dereferencing pointer to incomplete type
ipw2200.c: At top level:
ipw2200.c:1201: warning: `struct device' declared inside parameter list
ipw2200.c: In function `store_eeprom_delay':
ipw2200.c:1203: error: dereferencing pointer to incomplete type
ipw2200.c: At top level:
ipw2200.c:1207: error: syntax error before numeric constant
ipw2200.c:1207: warning: type defaults to `int' in declaration of `DEVICE_ATTR'
ipw2200.c:1207: warning: function declaration isn't a prototype
ipw2200.c:1208: warning: type defaults to `int' in declaration of `show_eeprom_delay'
ipw2200.c:1208: error: `show_eeprom_delay' redeclared as different kind of symbol
ipw2200.c:1196: error: previous declaration of `show_eeprom_delay'
ipw2200.c:1208: warning: type defaults to `int' in declaration of `store_eeprom_delay'
ipw2200.c:1208: error: `store_eeprom_delay' redeclared as different kind of symbol
ipw2200.c:1202: error: previous declaration of `store_eeprom_delay'
ipw2200.c:1208: error: syntax error before ')' token
ipw2200.c:1210: warning: `struct device' declared inside parameter list
ipw2200.c: In function `show_command_event_reg':
ipw2200.c:1213: error: dereferencing pointer to incomplete type
ipw2200.c: At top level:
ipw2200.c:1220: warning: `struct device' declared inside parameter list
ipw2200.c: In function `store_command_event_reg':
ipw2200.c:1223: error: dereferencing pointer to incomplete type
ipw2200.c: At top level:
ipw2200.c:1229: error: syntax error before numeric constant
ipw2200.c:1229: warning: type defaults to `int' in declaration of `DEVICE_ATTR'
ipw2200.c:1229: warning: function declaration isn't a prototype
ipw2200.c:1230: warning: type defaults to `int' in declaration of `show_command_event_reg'
ipw2200.c:1230: error: `show_command_event_reg' redeclared as different kind of symbol
ipw2200.c:1211: error: previous declaration of `show_command_event_reg'
ipw2200.c:1230: warning: type defaults to `int' in declaration of `store_command_event_reg'
ipw2200.c:1230: error: `store_command_event_reg' redeclared as different kind of symbol
ipw2200.c:1221: error: previous declaration of `store_command_event_reg'
ipw2200.c:1230: error: syntax error before ')' token
ipw2200.c:1232: warning: `struct device' declared inside parameter list
ipw2200.c: In function `show_mem_gpio_reg':
ipw2200.c:1235: error: dereferencing pointer to incomplete type
ipw2200.c: At top level:
ipw2200.c:1242: warning: `struct device' declared inside parameter list
ipw2200.c: In function `store_mem_gpio_reg':
ipw2200.c:1245: error: dereferencing pointer to incomplete type
ipw2200.c: At top level:
ipw2200.c:1251: error: syntax error before numeric constant
ipw2200.c:1251: warning: type defaults to `int' in declaration of `DEVICE_ATTR'
ipw2200.c:1251: warning: function declaration isn't a prototype
ipw2200.c:1252: warning: type defaults to `int' in declaration of `show_mem_gpio_reg'
ipw2200.c:1252: error: `show_mem_gpio_reg' redeclared as different kind of symbol
ipw2200.c:1233: error: previous declaration of `show_mem_gpio_reg'
ipw2200.c:1252: warning: type defaults to `int' in declaration of `store_mem_gpio_reg'
ipw2200.c:1252: error: `store_mem_gpio_reg' redeclared as different kind of symbol
ipw2200.c:1243: error: previous declaration of `store_mem_gpio_reg'
ipw2200.c:1252: error: syntax error before ')' token
ipw2200.c:1254: warning: `struct device' declared inside parameter list
ipw2200.c: In function `show_indirect_dword':
ipw2200.c:1257: error: dereferencing pointer to incomplete type
ipw2200.c: At top level:
ipw2200.c:1267: warning: `struct device' declared inside parameter list
ipw2200.c: In function `store_indirect_dword':
ipw2200.c:1269: error: dereferencing pointer to incomplete type
ipw2200.c: At top level:
ipw2200.c:1275: error: syntax error before numeric constant
ipw2200.c:1275: warning: type defaults to `int' in declaration of `DEVICE_ATTR'
ipw2200.c:1275: warning: function declaration isn't a prototype
ipw2200.c:1276: warning: type defaults to `int' in declaration of `show_indirect_dword'
ipw2200.c:1276: error: `show_indirect_dword' redeclared as different kind of symbol
ipw2200.c:1255: error: previous declaration of `show_indirect_dword'
ipw2200.c:1276: warning: type defaults to `int' in declaration of `store_indirect_dword'
ipw2200.c:1276: error: `store_indirect_dword' redeclared as different kind of symbol
ipw2200.c:1268: error: previous declaration of `store_indirect_dword'
ipw2200.c:1276: error: syntax error before ')' token
ipw2200.c:1278: warning: `struct device' declared inside parameter list
ipw2200.c: In function `show_indirect_byte':
ipw2200.c:1281: error: dereferencing pointer to incomplete type
ipw2200.c: At top level:
ipw2200.c:1291: warning: `struct device' declared inside parameter list
ipw2200.c: In function `store_indirect_byte':
ipw2200.c:1293: error: dereferencing pointer to incomplete type
ipw2200.c: At top level:
ipw2200.c:1299: error: syntax error before numeric constant
ipw2200.c:1299: warning: type defaults to `int' in declaration of `DEVICE_ATTR'
ipw2200.c:1299: warning: function declaration isn't a prototype
ipw2200.c:1300: warning: type defaults to `int' in declaration of `show_indirect_byte'
ipw2200.c:1300: error: `show_indirect_byte' redeclared as different kind of symbol
ipw2200.c:1279: error: previous declaration of `show_indirect_byte'
ipw2200.c:1300: warning: type defaults to `int' in declaration of `store_indirect_byte'
ipw2200.c:1300: error: `store_indirect_byte' redeclared as different kind of symbol
ipw2200.c:1292: error: previous declaration of `store_indirect_byte'
ipw2200.c:1300: error: syntax error before ')' token
ipw2200.c:1302: warning: `struct device' declared inside parameter list
ipw2200.c: In function `show_direct_dword':
ipw2200.c:1305: error: dereferencing pointer to incomplete type
ipw2200.c: At top level:
ipw2200.c:1316: warning: `struct device' declared inside parameter list
ipw2200.c: In function `store_direct_dword':
ipw2200.c:1318: error: dereferencing pointer to incomplete type
ipw2200.c: At top level:
ipw2200.c:1324: error: syntax error before numeric constant
ipw2200.c:1324: warning: type defaults to `int' in declaration of `DEVICE_ATTR'
ipw2200.c:1324: warning: function declaration isn't a prototype
ipw2200.c:1325: warning: type defaults to `int' in declaration of `show_direct_dword'
ipw2200.c:1325: error: `show_direct_dword' redeclared as different kind of symbol
ipw2200.c:1303: error: previous declaration of `show_direct_dword'
ipw2200.c:1325: warning: type defaults to `int' in declaration of `store_direct_dword'
ipw2200.c:1325: error: `store_direct_dword' redeclared as different kind of symbol
ipw2200.c:1317: error: previous declaration of `store_direct_dword'
ipw2200.c:1325: error: syntax error before ')' token
ipw2200.c:1338: warning: `struct device' declared inside parameter list
ipw2200.c: In function `show_rf_kill':
ipw2200.c:1344: error: dereferencing pointer to incomplete type
ipw2200.c: In function `ipw_radio_kill_sw':
ipw2200.c:1365: warning: implicit declaration of function `queue_work'
ipw2200.c: At top level:
ipw2200.c:1382: warning: `struct device' declared inside parameter list
ipw2200.c: In function `store_rf_kill':
ipw2200.c:1384: error: dereferencing pointer to incomplete type
ipw2200.c: At top level:
ipw2200.c:1390: error: syntax error before numeric constant
ipw2200.c:1390: warning: type defaults to `int' in declaration of `DEVICE_ATTR'
ipw2200.c:1390: warning: function declaration isn't a prototype
ipw2200.c:1390: warning: type defaults to `int' in declaration of `show_rf_kill'
ipw2200.c:1390: error: `show_rf_kill' redeclared as different kind of symbol
ipw2200.c:1339: error: previous declaration of `show_rf_kill'
ipw2200.c:1390: warning: type defaults to `int' in declaration of `store_rf_kill'
ipw2200.c:1390: error: `store_rf_kill' redeclared as different kind of symbol
ipw2200.c:1383: error: previous declaration of `store_rf_kill'
ipw2200.c:1390: error: syntax error before ')' token
ipw2200.c: In function `ipw_irq_tasklet':
ipw2200.c:1488: warning: implicit declaration of function `schedule_work'
ipw2200.c: In function `ipw_send_cmd':
ipw2200.c:1609: warning: implicit declaration of function `wait_event_interruptible_timeout'
ipw2200.c: In function `ipw_get_fw':
ipw2200.c:2834: error: structure has no member named `dev'
ipw2200.c: In function `ipw_gather_stats':
ipw2200.c:3721: warning: duplicate `const'
ipw2200.c:3721: warning: duplicate `const'
ipw2200.c:3721: warning: duplicate `const'
ipw2200.c:3721: warning: duplicate `const'
ipw2200.c:3721: warning: duplicate `const'
ipw2200.c:3721: warning: duplicate `const'
ipw2200.c:3721: warning: duplicate `const'
ipw2200.c: In function `ipw_wpa_set_encryption':
ipw2200.c:5794: warning: implicit declaration of function `request_module_R27e4dc04'
ipw2200.c:5824: warning: implicit declaration of function `try_module_get'
ipw2200.c: In function `ipw_wpa_supplicant':
ipw2200.c:5908: warning: implicit declaration of function `copy_from_user'
ipw2200.c:5939: warning: implicit declaration of function `copy_to_user'
ipw2200.c: In function `ipw_setup_deferred_work':
ipw2200.c:8263: warning: implicit declaration of function `create_workqueue'
ipw2200.c:8263: warning: assignment makes pointer from integer without a cast
ipw2200.c:8267: warning: implicit declaration of function `INIT_WORK'
ipw2200.c: At top level:
ipw2200.c:8638: error: `dev_attr_rf_kill' undeclared here (not in a function)
ipw2200.c:8638: error: initializer element is not constant
ipw2200.c:8638: error: (near initialization for `ipw_sysfs_entries[0]')
ipw2200.c:8639: error: `dev_attr_direct_dword' undeclared here (not in a function)
ipw2200.c:8639: error: initializer element is not constant
ipw2200.c:8639: error: (near initialization for `ipw_sysfs_entries[1]')
ipw2200.c:8640: error: `dev_attr_indirect_byte' undeclared here (not in a function)
ipw2200.c:8640: error: initializer element is not constant
ipw2200.c:8640: error: (near initialization for `ipw_sysfs_entries[2]')
ipw2200.c:8641: error: `dev_attr_indirect_dword' undeclared here (not in a function)
ipw2200.c:8641: error: initializer element is not constant
ipw2200.c:8641: error: (near initialization for `ipw_sysfs_entries[3]')
ipw2200.c:8642: error: `dev_attr_mem_gpio_reg' undeclared here (not in a function)
ipw2200.c:8642: error: initializer element is not constant
ipw2200.c:8642: error: (near initialization for `ipw_sysfs_entries[4]')
ipw2200.c:8643: error: `dev_attr_command_event_reg' undeclared here (not in a function)
ipw2200.c:8643: error: initializer element is not constant
ipw2200.c:8643: error: (near initialization for `ipw_sysfs_entries[5]')
ipw2200.c:8644: error: `dev_attr_nic_type' undeclared here (not in a function)
ipw2200.c:8644: error: initializer element is not constant
ipw2200.c:8644: error: (near initialization for `ipw_sysfs_entries[6]')
ipw2200.c:8645: error: `dev_attr_status' undeclared here (not in a function)
ipw2200.c:8645: error: initializer element is not constant
ipw2200.c:8645: error: (near initialization for `ipw_sysfs_entries[7]')
ipw2200.c:8646: error: `dev_attr_cfg' undeclared here (not in a function)
ipw2200.c:8646: error: initializer element is not constant
ipw2200.c:8646: error: (near initialization for `ipw_sysfs_entries[8]')
ipw2200.c:8647: error: `dev_attr_dump_errors' undeclared here (not in a function)
ipw2200.c:8647: error: initializer element is not constant
ipw2200.c:8647: error: (near initialization for `ipw_sysfs_entries[9]')
ipw2200.c:8648: error: `dev_attr_dump_events' undeclared here (not in a function)
ipw2200.c:8648: error: initializer element is not constant
ipw2200.c:8648: error: (near initialization for `ipw_sysfs_entries[10]')
ipw2200.c:8649: error: `dev_attr_eeprom_delay' undeclared here (not in a function)
ipw2200.c:8649: error: initializer element is not constant
ipw2200.c:8649: error: (near initialization for `ipw_sysfs_entries[11]')
ipw2200.c:8650: error: `dev_attr_ucode_version' undeclared here (not in a function)
ipw2200.c:8650: error: initializer element is not constant
ipw2200.c:8650: error: (near initialization for `ipw_sysfs_entries[12]')
ipw2200.c:8651: error: `dev_attr_rtc' undeclared here (not in a function)
ipw2200.c:8651: error: initializer element is not constant
ipw2200.c:8651: error: (near initialization for `ipw_sysfs_entries[13]')
ipw2200.c:8652: error: `dev_attr_scan_age' undeclared here (not in a function)
ipw2200.c:8652: error: initializer element is not constant
ipw2200.c:8652: error: (near initialization for `ipw_sysfs_entries[14]')
ipw2200.c:8653: error: `dev_attr_led' undeclared here (not in a function)
ipw2200.c:8653: error: initializer element is not constant
ipw2200.c:8653: error: (near initialization for `ipw_sysfs_entries[15]')
ipw2200.c:8654: error: `dev_attr_stats' undeclared here (not in a function)
ipw2200.c:8654: error: initializer element is not constant
ipw2200.c:8654: error: (near initialization for `ipw_sysfs_entries[16]')
ipw2200.c:8658: error: variable `ipw_attribute_group' has initializer but incomplete type
ipw2200.c:8659: error: unknown field `name' specified in initializer
ipw2200.c:8659: warning: excess elements in struct initializer
ipw2200.c:8659: warning: (near initialization for `ipw_attribute_group')
ipw2200.c:8660: error: unknown field `attrs' specified in initializer
ipw2200.c:8660: warning: excess elements in struct initializer
ipw2200.c:8660: warning: (near initialization for `ipw_attribute_group')
ipw2200.c: In function `ipw_pci_probe':
ipw2200.c:8700: warning: implicit declaration of function `pci_set_consistent_dma_mask'
ipw2200.c:8855: warning: implicit declaration of function `sysfs_create_group'
ipw2200.c:8855: error: structure has no member named `dev'
ipw2200.c:8871: warning: implicit declaration of function `sysfs_remove_group'
ipw2200.c:8871: error: structure has no member named `dev'
ipw2200.c:8875: warning: implicit declaration of function `destroy_workqueue'
ipw2200.c: In function `ipw_pci_remove':
ipw2200.c:8898: error: structure has no member named `dev'
ipw2200.c: In function `ipw_init':
ipw2200.c:9039: warning: implicit declaration of function `driver_create_file'
ipw2200.c:9039: error: structure has no member named `driver'
ipw2200.c:9040: error: `driver_attr_debug_level' undeclared (first use in this function)
ipw2200.c:9040: error: (Each undeclared identifier is reported only once
ipw2200.c:9040: error: for each function it appears in.)
ipw2200.c: In function `ipw_exit':
ipw2200.c:9052: warning: implicit declaration of function `driver_remove_file'
ipw2200.c:9052: error: structure has no member named `driver'
ipw2200.c:9052: error: `driver_attr_debug_level' undeclared (first use in this function)
ipw2200.c: At top level:
ipw2200.c:8658: error: storage size of `ipw_attribute_group' isn't known
ipw2200.c:1006: warning: `show_debug_level' defined but not used
ipw2200.c:1011: warning: `store_debug_level' defined but not used
ipw2200.c:1031: warning: `DRIVER_ATTR' declared `static' but never defined
ipw2200.c:1032: warning: `show_debug_level' defined but not used
ipw2200.c:1032: warning: `store_debug_level' defined but not used
ipw2200.c:1038: warning: `show_stats' defined but not used
ipw2200.c:1390: warning: `DEVICE_ATTR' declared `static' but never defined
ipw2200.c:1044: warning: `show_stats' defined but not used
ipw2200.c:1048: warning: `show_scan_age' defined but not used
ipw2200.c:1054: warning: `store_scan_age' defined but not used
ipw2200.c:1088: warning: `show_scan_age' defined but not used
ipw2200.c:1088: warning: `store_scan_age' defined but not used
ipw2200.c:1091: warning: `show_led' defined but not used
ipw2200.c:1097: warning: `store_led' defined but not used
ipw2200.c:1118: warning: `show_led' defined but not used
ipw2200.c:1118: warning: `store_led' defined but not used
ipw2200.c:1122: warning: `show_status' defined but not used
ipw2200.c:1126: warning: `show_status' defined but not used
ipw2200.c:1129: warning: `show_cfg' defined but not used
ipw2200.c:1133: warning: `show_cfg' defined but not used
ipw2200.c:1136: warning: `show_nic_type' defined but not used
ipw2200.c:1141: warning: `show_nic_type' defined but not used
ipw2200.c:1145: warning: `dump_error_log' defined but not used
ipw2200.c:1157: warning: `dump_event_log' defined but not used
ipw2200.c:1168: warning: `show_ucode_version' defined but not used
ipw2200.c:1177: warning: `show_ucode_version' defined but not used
ipw2200.c:1180: warning: `show_rtc' defined but not used
ipw2200.c:1189: warning: `show_rtc' defined but not used
ipw2200.c:1196: warning: `show_eeprom_delay' defined but not used
ipw2200.c:1202: warning: `store_eeprom_delay' defined but not used
ipw2200.c:1208: warning: `show_eeprom_delay' defined but not used
ipw2200.c:1208: warning: `store_eeprom_delay' defined but not used
ipw2200.c:1211: warning: `show_command_event_reg' defined but not used
ipw2200.c:1221: warning: `store_command_event_reg' defined but not used
ipw2200.c:1230: warning: `show_command_event_reg' defined but not used
ipw2200.c:1230: warning: `store_command_event_reg' defined but not used
ipw2200.c:1233: warning: `show_mem_gpio_reg' defined but not used
ipw2200.c:1243: warning: `store_mem_gpio_reg' defined but not used
ipw2200.c:1252: warning: `show_mem_gpio_reg' defined but not used
ipw2200.c:1252: warning: `store_mem_gpio_reg' defined but not used
ipw2200.c:1255: warning: `show_indirect_dword' defined but not used
ipw2200.c:1268: warning: `store_indirect_dword' defined but not used
ipw2200.c:1276: warning: `show_indirect_dword' defined but not used
ipw2200.c:1276: warning: `store_indirect_dword' defined but not used
ipw2200.c:1279: warning: `show_indirect_byte' defined but not used
ipw2200.c:1292: warning: `store_indirect_byte' defined but not used
ipw2200.c:1300: warning: `show_indirect_byte' defined but not used
ipw2200.c:1300: warning: `store_indirect_byte' defined but not used
ipw2200.c:1303: warning: `show_direct_dword' defined but not used
ipw2200.c:1317: warning: `store_direct_dword' defined but not used
ipw2200.c:1325: warning: `show_direct_dword' defined but not used
ipw2200.c:1325: warning: `store_direct_dword' defined but not used
ipw2200.c:1339: warning: `show_rf_kill' defined but not used
ipw2200.c:1383: warning: `store_rf_kill' defined but not used
ipw2200.c:1390: warning: `show_rf_kill' defined but not used
ipw2200.c:1390: warning: `store_rf_kill' defined but not used
make[4]: *** [ipw2200.o] Error 1
make[4]: Leaving directory `/usr/src/modules/ipw2200/driver'
make[3]: *** [_mod_/usr/src/modules/ipw2200/driver] Error 2
make[3]: Leaving directory `/usr/src/kernel-headers-2.4.27-2-386'
make[2]: *** [modules] Error 2
make[2]: Leaving directory `/usr/src/modules/ipw2200/driver'
make[1]: *** [binary-modules] Error 2
make[1]: Leaving directory `/usr/src/modules/ipw2200'
make: *** [kdist_build] Error 2[/code:1:f8182d69f7]

Előre is köszönöm a segítséget!

[quote:cb5892f49e="ScOut3R"]Sewastok!

Rengeteget keresgéltem neten, de nem találtam semmilyen megoldást a problémámra. Követtem jónéhány leírást a fent említett hálókari telepítéséhez. Firmware a helyén, source apt-get-tel telepítve. Module-assisntant-tal próbáltam forgatni, de leáll, és nem tudtam kideríteni miért.
Itt a buildlog releváns része:
[code:1:cb5892f49e]
In file included from ipw2200.c:33:
ipw2200.h:54:29: linux/workqueue.h: Nincs ilyen fájl vagy könyvtár
[/code:1:cb5892f49e]

a baj itt kezdodik

janus: arra én is rájöttem. :)

selli: tiszta hülye vagyok, csak a header-eket tettem fel. :(
Most forgatom a 2.6-os kernelt, utána megpróbálom megint az ipw-t.
Köszi a segítséget! Még jelentkezem.

[quote:102e545712="ScOut3R"]janus: arra én is rájöttem. :)

ok, csak jeleztem, mert az az utani hibauzenetek, mar ugy sem ernek semmit, mivel a hianyzo file okozza oket

[quote:102e545712="ScOut3R"]
selli: tiszta hülye vagyok, csak a header-eket tettem fel. :(

normalis esetben eleg kellene hogy legyen a headers, pl uhu alatt eleg volt, ott tudtam ipw drivert forditani kernel forras nelkul

2.6-os kernellel, megfelelő header-rel hibátlanul lefordult. :) Köszönöm a segítséget!